Term
type: Class
subclass of: RDwlKpb9IShLYudIGwWGwoi
definition: A term is a unit of meaning that represents a specific concept or idea, and is a child of the logical formula class in the OASIS ontology.