Limited Duration Company
type: Class
alternative label: 有限期公司
subclass of: R7oBWHStfmqTLn2MypkW3Pj
definition: A Limited Duration Company is a company which is registered under the International Business Companies Act with a maximum life span of fifty years.