Development of Property Practice
type: Class
preferred label: Real Property Development Practice
alternative label: 房地产实践发展
subclass of: RKzL5nW7IGg4mvAPFX2MUL
hidden label: DEV
definition: A transaction for the modification or building of something on real property.