Declaratory Judgment Claim
type: Class
alternative label: 宣告判决诉讼
subclass of: R8jYAnNATrfoBxAtIKpf72X
subclass of: RDbz1PVc6y57oOb9jAIl0eN
definition: A Declaratory Judgment (Claim) is a civil claim seeking a court's declaration of the parties' rights and legal obligations without ordering any specific action or awarding damages.