Fraud
type: Class
alternative label: 欺诈
subclass of: R8GyyJdxlZtc7PsW9vLAKfE
subclass of: RBAoFbSK8WP6xJyVrgQd5PZ
subclass of: RCzs34uEQI9f4cuWp3bQO0P
definition: Fraud is the intentional act of deceiving someone in order to gain an unfair advantage or cause harm.