Motion to Withdraw
type: Class
alternative label: 撤回动议
subclass of: R8zwKGkogGKIKWSVWb1ItRL
subclass of: R9Ii4OzSADsjS0VegX12oQJ
definition: A Motion to Withdraw is a formal request made by an attorney to remove themselves from representing a client in a legal matter, either as counsel or to withdraw a previously filed document.