Georgia Superior Court - Irwin County
type: Class
subclass of: RCBE5bLTCIia7wAstjMsnKO
definition: Georgia Superior Court - Irwin County: A specific court within the Georgia Superior Court system that has jurisdiction over legal matters within Irwin County.