Karelian
type: Class
alternative label: 卡累利阿语
subclass of: RDOvAHsvY8TKJ1O1orXPM9o
definition: Karelian (Language) is a specific written or spoken structured system of communication that consists of grammar and vocabulary, and is a member of the Language top-level class.