Gothic
type: Class
alternative label: 哥特式
subclass of: RDOvAHsvY8TKJ1O1orXPM9o
definition: A language that was spoken by the Goths, a Germanic people who played a significant role in the fall of the Western Roman Empire.