French
type: Class
alternative label: 法语
subclass of: RDOvAHsvY8TKJ1O1orXPM9o
definition: French (Language) is a structured system of communication consisting of grammar and vocabulary, used in legal matters as a means of document, artifact, evidence, testimony, proceeding, or any other legal aspect, and is a subcategory of the Language top-level class.