Crewmember Visa - Different Vessels
type: Class
alternative label: D-2 Visa
subclass of: RDJssYq6dD0i6zlieP3cotj
definition: Non-immigrant visa for crew members who work on a marine vessel or aircraft and will depart on a different vessel than the one they arrived on.