899 Administrative Procedure Act/Review or Appeal of Agency Decision (PACER NoS)
type: Class
subclass of: RCLxFZZvTWZmKpUYJa6UMmO
definition: Action filed under the Administrative Procedures Act, 5 U.S.C. § 701, or civil actions to review or appeal a federal agency decision.