Chamorro
type: Class
alternative label: 查莫罗语
subclass of: RDOvAHsvY8TKJ1O1orXPM9o
definition: Chamorro (Language) is a structured system of communication that consists of grammar and vocabulary specific to the Chamorro people of the Mariana Islands.