California Superior Court
type: Class
subclass of: R688d7293074eA6C38b47f71
definition: The California Superior Court is a court of general jurisdiction in the California State Courts system, responsible for hearing civil and criminal cases within its jurisdictional boundaries.