Creoles and pidgins, English based
type: Class
alternative label: 以英语为基础的克里奥尔语和皮钦语
subclass of: RDOvAHsvY8TKJ1O1orXPM9o
definition: A type of language that is based on English but has developed from a mixture of different languages and is used as a means of communication between people who do not share a common language.