Office of Compliance
type: Class
alternative label: OOC
subclass of: RnSHqIE6kW486gQwcgL03v
definition: The Office of Compliance (OOC) is a specific administrative proceeding venue responsible for ensuring compliance with workplace laws and regulations.