Pennsylvania Court of Common Pleas - Huntingdon County
type: Class
subclass of: Rzg8mCIjXsMzEVnQwCTKIi
definition: The Pennsylvania Court of Common Pleas - Huntingdon County is a specific court within the Pennsylvania Court of Common Pleas system, which is responsible for administering legal proceedings in Huntingdon County, Pennsylvania.