Court Fees Expense
type: Class
alternative label: 法院费用支出
subclass of: R8KRPJpptKbBzyQalWni4Zv
definition: Court Fees Expense refers to the costs incurred by a party in a legal matter for filing documents, motions, or other court-related activities.