Economic Experts
type: Class
alternative label: 经济专家
subclass of: R8t7u58Bmu2hmFFto8S64nx
definition: An expert in a monetary areas, including accounting, appraisal, damages, securities, and other areas of finance.