Duration of the Contract Clause
type: Class
alternative label: 合同期限条款
subclass of: RDe0RKU39BlhcyACJW30ZLc
definition: The Duration of the Contract Clause is a provision in a contract that specifies the length of time that the agreement will remain in effect.