Case Assessment, Development, Administration Documents
type: Class
alternative label: 案例评估、开发、管理文件
subclass of: Rjco9ohucVSJ0XxprM5Opb
definition: Documents related to the evaluation, creation, and management of legal cases, including but not limited to pleadings, motions, and discovery requests.