"'Reasonably likely/expected to be inconsistent' with fiduciary duties" Language
type: Class
alternative label: “合理地可能/预计与受托责任不一致”
subclass of: R9ksYmaNhrwE6VL9r0qV1sL
subclass of: RB9kHJwRBkXjBRaeSNiyPWY
subclass of: RDnJ5pHeJZuA0vHQXYalZO6
subclass of: RDxvjss5OK7lnAY9w2RaGeB
definition: "'Reasonably likely/expected to be inconsistent' with fiduciary duties" Language refers to a specific phrase used in legal documents that indicates actions or decisions that may go against the responsibilities and obligations of a fiduciary, such as a trustee or agent, and may result in legal consequences.