Abstention Doctrines
type: Class
alternative label: 弃权原则
subclass of: RB7BB00LuJawNLM8CZW6z7U
definition: Abstention Doctrines refer to legal theories that allow federal courts to abstain from exercising jurisdiction over a case in deference to state court proceedings, including Pullman Abstention, Brillhart-Wilton Abstention, Younger Abstention, Burford Abstention, and Colorado River Abstention.