Risk Benefit Test
type: Class
alternative label: 风险效益测试
subclass of: RCc50c8MA7S8aeFuufxdksV
definition: A Risk Benefit Test is a defense used in product liability cases where the defendant argues that the benefits of the product outweigh the risks associated with it.