Withdrawal of Claim
type: Class
alternative label: 撤回索赔
subclass of: R8zijLH2GH0SxOhIdzeDOs3
definition: Withdrawal of Claim refers to the act of retracting a previously filed claim in a bankruptcy or restructuring document.