Slavic languages
type: Class
alternative label: 斯拉夫语言
subclass of: RDOvAHsvY8TKJ1O1orXPM9o
definition: Slavic languages are a group of related languages spoken in Eastern Europe, characterized by their use of the Cyrillic alphabet and shared grammatical features.