AAA Construction Industry Arbitration Rules and Mediation Procedures
type: Class
alternative label: AAA建筑行业仲裁规则和调解程序
subclass of: R7uzfpLbCGc2taU7nsJBuor
definition: The AAA Construction Industry Arbitration Rules and Mediation Procedures are a set of guidelines and procedures established by the American Arbitration Association for resolving disputes in the construction industry through arbitration and mediation.