Missouri Circuit Court - Nodaway County
type: Class
subclass of: RDECjssxw76vdlahxiUTb4L
definition: A Missouri Circuit Court in Nodaway County is a specific court within the Missouri Circuit Court system that has jurisdiction over legal matters within Nodaway County.