German, Middle High
type: Class
alternative label: 中古德语
subclass of: RDOvAHsvY8TKJ1O1orXPM9o
definition: Middle High German is a structured system of communication used between 1050 and 1500, and is considered a language in the context of legal matters.