M&A F4 Environmental Practice
type: Class
alternative label: M&A F4 环境实践
subclass of: R8B946ewYpMD86GqDEqxNS
definition: M&A F4 Environmental Practice refers to the legal work performed by a Legal Services Provider in the course of a merger or acquisition transaction that involves regulatory and specialty matters related to environmental issues.