Disability / Loss of a Normal Life
type: Class
alternative label: 残疾 / 失去正常生活
subclass of: RBgykmvlnXtCsXRVIBMbLrV
definition: The concept of Disability/Loss of a Normal Life refers to the physical or mental impairment that results in a diminished ability to enjoy life's activities and experiences, and the resulting non-economic damages that may be awarded in a legal matter.