Landlord's Failure to Protect Tenant from Crime
type: Class
alternative label: 房东未能保护租户免受犯罪侵害
subclass of: R97svnIdQhrkKZw6i3Nn88z
definition: The failure of a landlord to provide adequate protection to a tenant from criminal activity, resulting in harm or injury to the tenant.