Nominal Damages
type: Class
alternative label: 名义损害赔偿
subclass of: RB2CEA5hNfHnNl8DMKIfK5F
definition: Nominal Damages are a small amount of money awarded to a plaintiff in a lawsuit to recognize a legal wrong, without compensating for any actual loss or injury.