Cybersecurity Risk
type: Class
alternative label: Cyber Risk
subclass of: R7xla5mpMCkDl1t6YAR0Eoh
definition: The potential of loss or damage from a cyber event such as a data breach, cyber attack, or system failure.