Approved During Tail Period
type: Class
alternative label: 尾部期间批准
subclass of: R7xvhTRvZsOK7xYmQh6eEKG
definition: A legal term referring to the approval of an acquisition proposal during the final period of the transaction.