D.C. Office of Bar Counsel
type: Class
subclass of: R16E44cA98bb827F808ADdfd
definition: The D.C. Office of Bar Counsel is an entity within the District of Columbia Courts that is responsible for administering proceedings related to attorney discipline and ethics.