245 Tort Product Liability (PACER NoS)
type: Class
subclass of: RbYFWy3aL3B2HCQhVuEWyx
definition: Action alleging harm by an unsafe product based on negligence, breach of warranty, misrepresentation, and strict tort liability.