Bankruptcy Means Test
type: Class
alternative label: 破产财产测试
subclass of: R8zijLH2GH0SxOhIdzeDOs3
definition: The Bankruptcy Means Test is a document used in bankruptcy and restructuring proceedings to determine whether an individual or business is eligible for bankruptcy relief based on their income and expenses.