North Dakota Office of the Attorney General
type: Class
subclass of: RE3003998F1deFDFa56FC907
definition: The North Dakota Office of the Attorney General is a government entity responsible for providing legal advice and representation to the state of North Dakota, and is a part of the North Dakota State Courts system.