Business Risk
type: Class
subclass of: RDsWDLg5JUKHPw6my6QzmoU
definition: Distinct from legal risks, those risks to the business's operations (e.g., capital, reputation, financial management, programs)