Invoice Date Received
type: Class
alternative label: 收到发票日期
subclass of: RC7G4chfaS2wrJ4zwbSMhX
definition: The "Invoice Date Received" concept refers to the specific date on which an invoice was received by the recipient, and is a subcategory of the broader concept of "Invoice Date".