Elder Abuse
type: Class
alternative label: 虐待老人
subclass of: R86KwDCIco0lQwycGRDQ7M1
definition: The mistreatment or harm inflicted upon an elderly person, which can take the form of financial exploitation or physical abuse.