Indiana Circuit Court - Decatur County
type: Class
subclass of: RCeiXNGpqL4H3jo1g1NobSm
definition: A court located in Decatur County, Indiana that has jurisdiction over certain legal matters within its geographic area.