Damages Clause
type: Class
alternative label: 损害赔偿条款
subclass of: RDe0RKU39BlhcyACJW30ZLc
definition: A damages clause is a provision in a contract that specifies the amount of money that one party must pay to the other in the event of a breach of contract.