Buddhist Law
type: Class
alternative label: Vinaya
subclass of: RBkzNeCV70lWNDKaIVq358i
definition: Buddhist Law, while not codified as a formal legal system in most regions, refers to the ethical and moral teachings derived from the teachings of the Buddha, especially the Vinaya, which governs the conduct of Buddhist monastics.