Lesbian
type: Class
subclass of: R8yT48TVCNCeeyY7WXNjCt3
definition: Lesbian refers to a woman who is attracted to other women. It is a sexual orientation that is part of the LGBTQIA+ spectrum, and like other orientations, the experience of being lesbian can vary among individuals.