P500 Negotiation/Revision/Responses
type: Class
subclass of: Rn5kG4YdbRjOyGEVaUvrizw
definition: This phase includes conducting negotiations, revising the initial (P400) transaction documentation as a result of such negotiations, attendance at meetings, and responses thereto (including communications with clients with respect thereto). The review of documents received from non-client third parties should also be coded here.