Fraud and Economic Torts Law
type: Class
alternative label: 欺诈和经济侵权法
subclass of: R7MK1XmyjtYxZKg8Iw4ZN4K
hidden label: FRAU
definition: The wrong done by another person or business that occurs in, or affects, commerce.