L656 Redaction
type: Class
subclass of: RRZH1jQQiTpCF8VKy9TUZNw
definition: Activities and actions related to the development and implementation of a redaction protocol and the actual redaction of data and documents consistent with such a protocol.