Creoles and pidgins, French-based
type: Class
alternative label: 法语为基础的克里奥尔语和皮钦语
subclass of: RDOvAHsvY8TKJ1O1orXPM9o
definition: A French-based Creole or Pidgin language, which is a simplified language that develops as a means of communication between groups who do not share a common language, but have frequent contact with each other, and which has evolved from French.